Dicyclohexano-18-crown-6

Gas phase ion energetics data

Data compiled as indicated in comments:
LLK - Sharon G. Lias, Rhoda D. Levin, and Sherif A. Kafafi

Ionization energy determinations

IE (eV) Method Reference Comment
8.6PEKajitani, Sugimori, et al., 1979LLK
9.45PEKajitani, Sugimori, et al., 1979Vertical value; LLK

References

Kajitani, Sugimori, et al., 1979
Kajitani, M.; Sugimori, A.; Sato, N.; Seki, K.; Inokuchi, H.; Harada, Y., Ultraviolet photoelectron spectra of crown ethers, Bull. Chem. Soc. Jpn., 1979, 52, 2199. [all data]