tetrakis(hexafluoroisopropoxy)tetrakis(2,2,6,6-tetramethylheptan-3,5-dionato)barium(II)diyttrium(III)

Phase change data

Data compiled by: William E. Acree, Jr., James S. Chickos

Enthalpy of sublimation

ΔsubH (kJ/mol) Temperature (K) Reference Comment
84.8382.Labrize, Hubert-Pfalzgraf, et al., 1996Based on data from 360. - 403. K.

References

Labrize, Hubert-Pfalzgraf, et al., 1996
Labrize, Florence; Hubert-Pfalzgraf, Liliane G.; Daran, Jean-Claude; Halut, Sabine; Tobaly, Pascal, Synthesis and characterization of volatile mixed-metal yttrium-barium, barium-copper and yttrium-copper β-diketonatofluoroisopropoxides. Molecular structure of BaY2[μ-OCH(CF3)2]4(thd)4, Polyhedron, 1996, 15, 16, 2707-2718, https://doi.org/10.1016/0277-5387(95)00557-9 . [all data]