1,4,5,6-Tetrahydropyrimidine

Condensed phase thermochemistry data

Data compiled as indicated in comments:
ALS - Hussein Y. Afeefy, Joel F. Liebman, and Stephen E. Stein
DH - Eugene S. Domalski and Elizabeth D. Hearing

Quantity Value Units Method Reference Comment
Δfliquid-20.54 ± 0.29kJ/molCcrSteele, Chirico, et al., 1996ALS
Quantity Value Units Method Reference Comment
Δcliquid-2696.82 ± 0.25kJ/molCcrSteele, Chirico, et al., 1996ALS

Constant pressure heat capacity of liquid

Cp,liquid (J/mol*K) Temperature (K) Reference Comment
157.97298.15Steele, Chirico, et al., 1993DH

References

Steele, Chirico, et al., 1996
Steele, W.V.; Chirico, R.D.; Knipmeyer, S.E.; Nguyen, A.; Smith, N.K.; Tasker, I.R., Thermodynamic properties and ideal-gas enthalpies of formation for cyclohexene, phthalan (2,5-dihydrobenzo-3,4-furan), isoxazole, octylamine, dioctylamine, trioctylamine, phenyl isocyanate, and 1,4,5,6-tetrahydropyrimidine, J. Chem. Eng. Data, 1996, 41, 1269-1284. [all data]

Steele, Chirico, et al., 1993
Steele, W.V.; Chirico, R.D.; Knipmeyer, S.E.; Nguyen, A.; Tasker, I.R., Determination of ideal gas enthalpies of formation for key compounds the 1991 project results, DIPPR Project, 1993, 871, NIPER-716. [all data]