Phosphine, methylbis(trifluoromethyl)-

Gas phase ion energetics data

Data compiled by: Sharon G. Lias, John E. Bartmess, Joel F. Liebman, John L. Holmes, Rhoda D. Levin, and W. Gary Mallard

Ionization energy determinations

IE (eV) Method Reference Comment
10.2PEGleiter, Goodmann, et al., 1983
10.8PEGleiter, Goodmann, et al., 1983Vertical value

References

Gleiter, Goodmann, et al., 1983
Gleiter, R.; Goodmann, W.D.; Schafer, W.; Grobe, J.; Apel, J., He(I)-PE spektren der verbindungen (CH3)nE(CF3)3-n fur E = P, us, Sb und n = 0 - 3, Chem. Ber., 1983, 116, 3745. [all data]