1,3,5,2,4,6-Triazatriphosphorine, 2,4,6-tribromo-2,4,6-trichloro-2,2,4,4,6,6-hexahydro-

Gas phase ion energetics data

Data compiled as indicated in comments:
RDSH - Henry M. Rosenstock, Keith Draxl, Bruce W. Steiner, and John T. Herron

Ionization energy determinations

IE (eV) Method Reference Comment
9.7 ± 0.1EICoxon, Palmer, et al., 1969RDSH

Appearance energy determinations

Ion AE (eV) Other Products MethodReferenceComment
P3N3Cl3Br2+10.3 ± 0.1BrEICoxon, Palmer, et al., 1969RDSH

References

Coxon, Palmer, et al., 1969
Coxon, G.E.; Palmer, T.F.; Sowerby, D.B., Cyclic inorganic compounds. Part VII.The mass spectra of the trimeric chlorobromophosphonitriles, J. Chem. Soc., 1969, (A), 358. [all data]