Vanadium, trinitratooxo-

Gas phase ion energetics data

Data compiled by: Sharon G. Lias, Rhoda D. Levin, and Sherif A. Kafafi

Ionization energy determinations

IE (eV) Method Reference Comment
12.33 ± 0.04PEGarner, Hawksworth, et al., 1980Vertical value

References

Garner, Hawksworth, et al., 1980
Garner, C.D.; Hawksworth, R.W.; Hillier, I.H.; MacDowell, A.A.; Guest, M.F., Electronic structure of the transition-metal nitrates Ti(NO3)4, VO(NO3)3, Co(NO3)3, and Cu(NO3)2. Studied by low-energy photoelectron spectroscopy and ab initio molecular orbital and scattered wave-Xα calculations, J. Am. Chem. Soc., 1980, 102, 4325. [all data]