Benzene,1-ethynyl-2,4-dimethyl-

Gas phase ion energetics data

Data compiled by: Sharon G. Lias, Rhoda D. Levin, and Sherif A. Kafafi

Ionization energy determinations

IE (eV) Method Reference Comment
8.31 ± 0.02PECarlier and Mouvier, 1979Vertical value

References

Carlier and Mouvier, 1979
Carlier, P.; Mouvier, G., Etude par spectrometrie de photoelectrons de la structure electronique des phenyl-alcynes conjugues, J. Electron Spectrosc. Relat. Phenom., 1979, 16, 169-181. [all data]