Ethylene oxide hydrate

Condensed phase thermochemistry data

Data compiled by: Eugene S. Domalski and Elizabeth D. Hearing

Quantity Value Units Method Reference Comment
liquid145.52cal/mol*KN/AYammamuro, Handa, et al., 1990

Constant pressure heat capacity of liquid

Cp,liquid (cal/mol*K) Temperature (K) Reference Comment
153.49298.15Yammamuro, Handa, et al., 1990T = 5 to 298.15 K. Since the melting point is 284.11 K, Cp value at 298.15 is anomolous.

References

Yammamuro, Handa, et al., 1990
Yammamuro, O.; Handa, Y.P.; Oguni, M.; Suga, H., Heat capacity and glass transition of ethylene oxide clathrate hydrate, J. Inclusion Phenom. Mol. Recognit. Chem., 1990, 8(1-2), 45-58. [all data]