Henicos-1-ene

Phase change data

Data compiled as indicated in comments:
TRC - Thermodynamics Research Center, NIST Boulder Laboratories, Chris Muzny director
AC - William E. Acree, Jr., James S. Chickos

Quantity Value Units Method Reference Comment
Tfus308.7KN/ASchmidt, 1942Uncertainty assigned by TRC = 1.5 K; TRC
Tfus308.7KN/ASchmidt, Schoeller, et al., 1941Uncertainty assigned by TRC = 2. K; TRC

Enthalpy of vaporization

ΔvapH (kJ/mol) Temperature (K) Reference Comment
92.8407.Dykyj, Svoboda, et al., 1999Based on data from 392. - 628. K.; AC

In addition to the Thermodynamics Research Center (TRC) data available from this site, much more physical and chemical property data is available from the following TRC products:

Van Den Dool and Kratz RI, non-polar column, custom temperature program

View large format table.

Column type Active phase I Reference Comment
CapillaryHP-5MS2089.1Andriamaharavo, 201430. m/0.25 mm/0.25 μm, He; Program: 60C (1 min) => 5 C/min => 210C => 10 C/min => 280C (15 min)

References

Schmidt, 1942
Schmidt, A.W., Physical properties of aliphatic compounds, Ber. Dtsch. Chem. Ges. B, 1942, 75, 1399. [all data]

Schmidt, Schoeller, et al., 1941
Schmidt, A.W.; Schoeller, V.; Eberlein, K., Chem. Ber., 1941, 74, 1313. [all data]

Dykyj, Svoboda, et al., 1999
Dykyj, J.; Svoboda, J.; Wilhoit, R.C.; Frenkel, M.L.; Hall, K.R., Vapor Pressure of Chemicals: Part A. Vapor Pressure and Antoine Constants for Hydrocarbons and Sulfur, Selenium, Tellurium and Hydrogen Containing Organic Compounds, Springer, Berlin, 1999, 373. [all data]

Andriamaharavo, 2014
Andriamaharavo, N.R., Retention Data. NIST Mass Spectrometry Data Center., NIST Mass Spectrometry Data Center, 2014. [all data]