Phosphonothioic acid, methyl-, S-(2-diethylaminoethyl), O-2-methylpropyl ester

Phase change data

Data compiled by: William E. Acree, Jr., James S. Chickos

Enthalpy of vaporization

ΔvapH (kJ/mol) Temperature (K) Method Reference Comment
76.6324.GCRittfeldt, 2001Based on data from 263. - 385. K.

Normal alkane RI, non-polar column, temperature ramp

View large format table.

Column type Active phase I Reference Comment
CapillaryDB-51689.Savel'eva, Zenkevich, et al., 200325. m/0.20 mm/0.33 μm, Helium, 40. C @ 1. min, 5. K/min, 270. C @ 15. min
CapillaryDB-51689.Savel'eva, Zenkevich, et al., 200225. m/0.20 mm/0.33 μm, Helium, 40. C @ 1. min, 5. K/min, 270. C @ 15. min

References

Rittfeldt, 2001
Rittfeldt, Lars, Determination of Vapor Pressure of Low-Volatility Compounds Using a Method To Obtain Saturated Vapor with Coated Capillary Columns, Anal. Chem., 2001, 73, 11, 2405-2411, https://doi.org/10.1021/ac010015v . [all data]

Savel'eva, Zenkevich, et al., 2003
Savel'eva, E.I.; Zenkevich, I.G.; Radilov, A.S., Identification the Products of Chemical Neutralization of O-Isobutyl-S-(2-diethylaminoethyl)methylthiophosphonate in the Composition of Bitumen-Salt Matrices, Zh. Anal. Khim. (Rus.), 2003, 58, 2, 135-145. [all data]

Savel'eva, Zenkevich, et al., 2002
Savel'eva, E.I.; Zenkevich, I.G.; Kuznetsova, T.A.; Radilov, A.S.; Pshenichnaya, G.V., Investigation of Products of Transformation of Phosphororganic Toxic Substances with Gas Chromatography - Mass Spectrometry, Rus. Khim. Zh. (Rus.), 2002, 56, 6, 82-91. [all data]