2,3-dihydro-5,6-dimethylpyrazine

Reaction thermochemistry data

Data compiled by: Hussein Y. Afeefy, Joel F. Liebman, and Stephen E. Stein

Individual Reactions

Hydrogen + 2,3-dihydro-5,6-dimethylpyrazine = Piperazine, 2,3-dimethyl-

By formula: H2 + C6H10N2 = C6H14N2

Quantity Value Units Method Reference Comment
Δr169.4kJ/molChydHafelinger and Steinmann, 1977liquid phase; solvent: Acetic acid

References

Hafelinger and Steinmann, 1977
Hafelinger, G.; Steinmann, L., Heat of hydrogenation of compounds containing isolated and conjugted C=N bouble bonds, Angew. Chem. Int. Ed. Engl., 1977, 16, 47-48. [all data]