2-Methyl-3-isopropylpyrazine

Van Den Dool and Kratz RI, non-polar column, temperature ramp

View large format table.

Column type Active phase I Reference Comment
CapillaryDB-11023.Kim, 200160. m/0.32 mm/1. μm, He, 40. C @ 5. min, 2. K/min; Tend: 220. C

Normal alkane RI, non-polar column, temperature ramp

View large format table.

Column type Active phase I Reference Comment
CapillaryOV-1011025.Mihara and Masuda, 19882. K/min; Column length: 50. m; Column diameter: 0.22 mm; Tstart: 80. C; Tend: 200. C
CapillaryDB-51056.Gallois and Grimont, 1985H2, 2. K/min; Column length: 60. m; Column diameter: 0.32 mm; Tstart: 40. C; Tend: 200. C

Normal alkane RI, non-polar column, custom temperature program

View large format table.

Column type Active phase I Reference Comment
CapillarySE-301028.Vinogradov, 2004Program: not specified

Normal alkane RI, polar column, temperature ramp

View large format table.

Column type Active phase I Reference Comment
CapillaryCarbowax 20M1362.Mihara and Masuda, 19882. K/min; Column length: 50. m; Column diameter: 0.22 mm; Tstart: 80. C; Tend: 200. C

Normal alkane RI, polar column, custom temperature program

View large format table.

Column type Active phase I Reference Comment
CapillaryCarbowax 20M1387.Vinogradov, 2004Program: not specified

References

Kim, 2001
Kim, J.S., Einfluss der Temperatur beim Rösten von Sesam auf Aroma und antioxidative Eigenschaften des Öls, PhD Thesis, Technischen Universität Berlin zur Erlangung des akademischen Grades, Berlin, 2001, 151. [all data]

Mihara and Masuda, 1988
Mihara, S.; Masuda, H., Structure-odor relationships for disubstituted pyrazines, J. Agric. Food Chem., 1988, 36, 6, 1242-1247, https://doi.org/10.1021/jf00084a029 . [all data]

Gallois and Grimont, 1985
Gallois, A.; Grimont, P.A.D., Pyrazines responsible for the potatolike odor produced by some Serratia and Cedecea strains, Appl. Environ. Microbiol., 1985, 10, 1048-1051. [all data]

Vinogradov, 2004
Vinogradov, B.A., Production, composition, properties and application of essential oils, 2004, retrieved from http://viness.narod.ru. [all data]