L-Glutamic acid, 3TMS derivative

Kovats' RI, non-polar column, isothermal

Data compiled by: NIST Mass Spectrometry Data Center, William E. Wallace, director

Column type CapillaryCapillaryCapillary
Active phase SP-2100SP-2100SE-54
Column length (m) 12.12.12.
Carrier gas HeHeHe
Substrate
Column diameter (mm) 0.20.20.2
Phase thickness (μm)
Temperature (C) 135.150.120.
I 1634.251629.401647.08
ReferenceGajewski, Dizdaroglu, et al., 1982Gajewski, Dizdaroglu, et al., 1982Gajewski, Dizdaroglu, et al., 1982
Comment MSDC-RI MSDC-RI MSDC-RI

Kovats' RI, non-polar column, temperature ramp

Data compiled by: NIST Mass Spectrometry Data Center, William E. Wallace, director

Column type Capillary
Active phase SP-2100
Column length (m) 12.
Carrier gas He
Substrate
Column diameter (mm) 0.2
Phase thickness (μm)
Tstart (C) 80.
Tend (C) 250.
Heat rate (K/min) 6.
Initial hold (min)
Final hold (min)
I 1642.34
ReferenceGajewski, Dizdaroglu, et al., 1982
Comment MSDC-RI

References

Gajewski, Dizdaroglu, et al., 1982
Gajewski, E.; Dizdaroglu, M.; Simic, M.G., Kovats' Indices of Trimethylsilylated Amino Acids on Fused-Silica Capillary Columns, J. Chromatogr., 1982, 249, 1, 41-55, https://doi.org/10.1016/S0021-9673(00)80231-9 . [all data]