Alachlor

Phase change data

Data compiled as indicated in comments:
TRC - Thermodynamics Research Center, NIST Boulder Laboratories, Chris Muzny director
AC - William E. Acree, Jr., James S. Chickos

Quantity Value Units Method Reference Comment
Tfus316.71KN/ADonnelly, Drewes, et al., 1990Uncertainty assigned by TRC = 0.2 K; TRC
Tfus315.KN/APlato, 1972Uncertainty assigned by TRC = 0.2 K; TRC

Enthalpy of vaporization

ΔvapH (kJ/mol) Temperature (K) Method Reference Comment
85. ± 1.436.TGAVecchio, 2007AC

Enthalpy of fusion

ΔfusH (kJ/mol) Temperature (K) Method Reference Comment
26.7317.7DSCSbirrazzuoli, Vecchio, et al., 2004AC
25.31315.9DSCDonnelly, Drewes, et al., 1990, 2AC

In addition to the Thermodynamics Research Center (TRC) data available from this site, much more physical and chemical property data is available from the following TRC products:

Normal alkane RI, non-polar column, temperature ramp

Data compiled by: NIST Mass Spectrometry Data Center, William E. Wallace, director

Column type CapillaryCapillary
Active phase DB-5Durabond-5
Column length (m) 30.30.
Carrier gas HeHelium
Substrate
Column diameter (mm) 0.250.25
Phase thickness (μm) 0.250.25
Tstart (C) 80.50.
Tend (C) 290.300.
Heat rate (K/min) 15.6.
Initial hold (min)  4.
Final hold (min)
I 1918.1922.
ReferenceSette, da Costa, et al., 2004Pereira, Rostad, et al., 1990
Comment MSDC-RI MSDC-RI

Van Den Dool and Kratz RI, non-polar column, temperature ramp

Data compiled by: NIST Mass Spectrometry Data Center, William E. Wallace, director

Column type CapillaryCapillary
Active phase SLB-5MSSLB-5MS
Column length (m) 30.30.
Carrier gas HeHe
Substrate
Column diameter (mm) 0.250.25
Phase thickness (μm) 0.250.25
Tstart (C) 70.70.
Tend (C) 300.300.
Heat rate (K/min) 2.2.
Initial hold (min)
Final hold (min)
I 1889.1896.
ReferenceMondello, Casilli, et al., 2007Mondello, Casilli, et al., 2007
Comment MSDC-RI MSDC-RI

Kovats' RI, non-polar column, temperature ramp

Data compiled by: NIST Mass Spectrometry Data Center, William E. Wallace, director

Column type CapillaryCapillary
Active phase DB-1DB-5
Column length (m) 15.15.
Carrier gas HeHe
Substrate
Column diameter (mm) 0.250.25
Phase thickness (μm)
Tstart (C) 100.100.
Tend (C) 270.270.
Heat rate (K/min) 6.6.
Initial hold (min)
Final hold (min)
I 1882.1918.
ReferenceHall, Whitehead, et al., 1986Hall, Whitehead, et al., 1986
Comment MSDC-RI MSDC-RI

Kovats' RI, non-polar column, isothermal

Data compiled by: NIST Mass Spectrometry Data Center, William E. Wallace, director

Column type CapillaryCapillary
Active phase OV-1OV-1
Column length (m)
Carrier gas
Substrate
Column diameter (mm)
Phase thickness (μm)
Temperature (C) 190.220.
I 1876.1897.
ReferenceErdmann, Rochholz, et al., 1992Erdmann, Rochholz, et al., 1992
Comment MSDC-RI MSDC-RI

References

Donnelly, Drewes, et al., 1990
Donnelly, J.R.; Drewes, L.A.; Johnson, R.L.; Munslow, W.D.; Knapp, K.K.; Sovocool, G.W., Purity and heat of fusion data for environmental standards as determined by differential scanning calorimetry, Thermochim. Acta, 1990, 167, 2, 155, https://doi.org/10.1016/0040-6031(90)80476-F . [all data]

Plato, 1972
Plato, C., DSC as a general method for determining purity and heat of fusion of high-purity organic chemicals, Anal. Chem., 1972, 44, 1531. [all data]

Vecchio, 2007
Vecchio, S., Contribution of thermal analysis to the description of transport phenomena of pesticides, J Therm Anal Calorim, 2007, 87, 1, 79-83, https://doi.org/10.1007/s10973-006-7826-5 . [all data]

Sbirrazzuoli, Vecchio, et al., 2004
Sbirrazzuoli, Nicolas; Vecchio, Stefano; Catalani, Alessia, Isoconversional kinetic study of alachlor and metolachlor vaporization by thermal analysis, Int. J. Chem. Kinet., 2004, 37, 2, 74-80, https://doi.org/10.1002/kin.20054 . [all data]

Donnelly, Drewes, et al., 1990, 2
Donnelly, J.R.; Drewes, L.A.; Johnson, R.L.; Munslow, W.D.; Knapp, K.K.; Sovocool, G.W., Purity and heat of fusion data for environmental standards as determined by differential scanning calorimetry, Thermochimica Acta, 1990, 167, 2, 155-187, https://doi.org/10.1016/0040-6031(90)80476-F . [all data]