Benzene, 1-methyl-4-(1-methylpropyl)-

Normal alkane RI, polar column, isothermal

Data compiled by: NIST Mass Spectrometry Data Center, William E. Wallace, director

Column type Capillary
Active phase Carbowax 20M
Column length (m)
Carrier gas
Substrate
Column diameter (mm)
Phase thickness (μm)
Temperature (C) 90.
I 1315.
ReferenceSutter, Peterson, et al., 1997
Comment MSDC-RI

Phase change data

Data compiled by: Thermodynamics Research Center, NIST Boulder Laboratories, Chris Muzny director

Quantity Value Units Method Reference Comment
Tboil467.KN/ASimons and Hart, 1944Uncertainty assigned by TRC = 5. K
Tboil475.KN/ABarkenbus, Hopkins, et al., 1939Uncertainty assigned by TRC = 4. K
Tboil469.KN/AShoesmith and McGechen, 1930Uncertainty assigned by TRC = 5. K
Tboil476.KN/AMeyer and Bernhauer, 1929Uncertainty assigned by TRC = 5. K
Tboil470.KN/AWallach, 1918Uncertainty assigned by TRC = 5. K

In addition to the Thermodynamics Research Center (TRC) data available from this site, much more physical and chemical property data is available from the following TRC products:

Kovats' RI, polar column, isothermal

Data compiled by: NIST Mass Spectrometry Data Center, William E. Wallace, director

Column type Capillary
Active phase Carbowax 20M
Column length (m) 100.
Carrier gas
Substrate
Column diameter (mm) 0.2
Phase thickness (μm)
Temperature (C) 90.
I 1315.4
ReferenceDöring, Estel, et al., 1974
Comment MSDC-RI

References

Sutter, Peterson, et al., 1997
Sutter, J.M.; Peterson, T.A.; Jurs, P.C., Prediction of gas chromatographic retention indices of alkylbenzenes, Anal. Chim. Acta., 1997, 342, 2-3, 113-122, https://doi.org/10.1016/S0003-2670(96)00578-8 . [all data]