C10H13NO2

Reaction thermochemistry data

Data compiled by: John E. Bartmess

Individual Reactions

C10H12NO2- + Hydrogen cation = C10H13NO2

By formula: C10H12NO2- + H+ = C10H13NO2

Quantity Value Units Method Reference Comment
Δr1404. ± 9.2kJ/molG+TSTaft and Topsom, 1987gas phase; value altered from reference due to change in acidity scale
Quantity Value Units Method Reference Comment
Δr1375. ± 8.4kJ/molIMRETaft and Topsom, 1987gas phase; value altered from reference due to change in acidity scale

References

Taft and Topsom, 1987
Taft, R.W.; Topsom, R.D., The Nature and Analysis of Substituent Effects, Prog. Phys. Org. Chem., 1987, 16, 1. [all data]