exo,endo-Tetracyclo[6.2.1.1(3,6).0(2,7)]dodeca-4,9-diene

Reaction thermochemistry data

Data compiled by: Hussein Y. Afeefy, Joel F. Liebman, and Stephen E. Stein

Individual Reactions

2Hydrogen + exo,endo-Tetracyclo[6.2.1.1(3,6).0(2,7)]dodeca-4,9-diene = exo,endo-Tetracyclo[6.2.1.1(3,6).0(2,7)]dodecane

By formula: 2H2 + C12H14 = C12H18

Quantity Value Units Method Reference Comment
Δr-69.2 ± 0.3kcal/molChydTurner, Jarrett, et al., 1973liquid phase; solvent: Acetic acid

References

Turner, Jarrett, et al., 1973
Turner, R.B.; Jarrett, A.D.; Goebel, P.; Mallon, B.J., Heats of hydrogenation. 9. Cyclic acetylenes and some miscellaneous olefins, J. Am. Chem. Soc., 1973, 95, 790-792. [all data]