(E)-3,4-Di-tert-butyl-3-hexen-1,5-diyne

Reaction thermochemistry data

Data compiled by: Hussein Y. Afeefy, Joel F. Liebman, and Stephen E. Stein

Individual Reactions

C14H20 = 3-Hexene-1,5-diyne, 3,4-bis(1,1-dimethylethyl)-, (Z)-

By formula: C14H20 = C14H20

Quantity Value Units Method Reference Comment
Δr13.4kcal/molEqkRoth, Hopf, et al., 1994gas phase; At 965 K

References

Roth, Hopf, et al., 1994
Roth, W.R.; Hopf, H.; Horn, C., Propargyl-Stabilisierungsenergie, Chem. Ber., 1994, 127, 1781-1795. [all data]