5-Decene-3,7-diyne, 2,9-dimethyl-, (Z)-

Reaction thermochemistry data

Data compiled by: Hussein Y. Afeefy, Joel F. Liebman, and Stephen E. Stein

Individual Reactions

C12H16 = 5-Decene-3,7-diyne, 2,9-dimethyl-, (Z)-

By formula: C12H16 = C12H16

Quantity Value Units Method Reference Comment
Δr2. ± 5.9kJ/molEqkRoth, Hopf, et al., 1994gas phase; At 983 K

References

Roth, Hopf, et al., 1994
Roth, W.R.; Hopf, H.; Horn, C., Propargyl-Stabilisierungsenergie, Chem. Ber., 1994, 127, 1781-1795. [all data]