Methyl 3-(methylthio)-(Z)-2-propenoate

Normal alkane RI, polar column, temperature ramp

Data compiled by: NIST Mass Spectrometry Data Center, William E. Wallace, director

Column type CapillaryCapillary
Active phase DB-WaxDB-Wax
Column length (m) 60.60.
Carrier gas H2He
Substrate
Column diameter (mm) 0.320.32
Phase thickness (μm) 0.250.25
Tstart (C) 60.30.
Tend (C) 220.180.
Heat rate (K/min) 3.2.
Initial hold (min)  4.
Final hold (min)  25.
I 1786.1773.
ReferenceWerkhoff, Güntert, et al., 1998Takeoka, Buttery, et al., 1991
Comment MSDC-RI MSDC-RI

References

Werkhoff, Güntert, et al., 1998
Werkhoff, P.; Güntert, M.; Krammer, G.; Sommer, H.; Kaulen, J., Vacuum headspace method in aroma research: flavor chemistry of yellow passion fruits, J. Agric. Food Chem., 1998, 46, 3, 1076-1093, https://doi.org/10.1021/jf970655s . [all data]

Takeoka, Buttery, et al., 1991
Takeoka, G.R.; Buttery, R.G.; Teranishi, R.; Flath, R.A.; Güntert, M., Identification of additional pineapple volatiles, J. Agric. Food Chem., 1991, 39, 10, 1848-1851, https://doi.org/10.1021/jf00010a032 . [all data]