Ru(EtCOCHCOEt)3 radical

Gas phase ion energetics data

Data compiled by: John E. Bartmess

Electron affinity determinations

EA (eV) Method Reference Comment
1.839 ± 0.065IMRBSharpe, Alameddin, et al., 1994EA given is actually -ΔGea(350 K)

References

Sharpe, Alameddin, et al., 1994
Sharpe, P.; Alameddin, N.G.; Richardson, D.E., Alkyl Substituent Effects in the Redox Thermochemistry of Coordination Compounds: Oxidation and Reduction Energetics for Ruthenium tris(b-diketonate) Complexes, J. Am. Chem. Soc., 1994, 116, 24, 11098, https://doi.org/10.1021/ja00103a027 . [all data]