Plumbane

Gas phase ion energetics data

Data compiled by: Henry M. Rosenstock, Keith Draxl, Bruce W. Steiner, and John T. Herron

Appearance energy determinations

Ion AE (eV) Other Products MethodReferenceComment
PbH+11.1?EISaalfeld and Svec, 1963
PbH2+10.1?EISaalfeld and Svec, 1963
PbH3+9.6HEISaalfeld and Svec, 1963
Pb+11.2?EISaalfeld and Svec, 1963

References

Saalfeld and Svec, 1963
Saalfeld, F.E.; Svec, H.J., The mass spectra of volatile hydrides. I. The monoelemental hydrides of the group IVB and VB elements, Inorg. Chem., 1963, 2, 46. [all data]