Citric acid, trimethyl ester

Normal alkane RI, non-polar column, temperature ramp

Data compiled by: NIST Mass Spectrometry Data Center, William E. Wallace, director

Column type CapillaryCapillaryCapillary
Active phase DB-5OV-101OV-101
Column length (m) 30.30.25.
Carrier gas HeH2He
Substrate
Column diameter (mm) 0.250.3
Phase thickness (μm) 0.25
Tstart (C) 40.80.75.
Tend (C) 290.275.280.
Heat rate (K/min) 4.2.2.
Initial hold (min)  7.7.
Final hold (min)
I 1461.1424.1424.
Referenceda Camara, Shepherd, et al., 2002Pinkston, Spiteller, et al., 1981Spiteller and Spiteller, 1979
Comment MSDC-RI MSDC-RI MSDC-RI

References

da Camara, Shepherd, et al., 2002
da Camara, C.A.G.; Shepherd, S.L.K.; Joaquim, D.R.G., Análise químnica da cultura de tecidos do híbrido Clusia paralicola X Clusia weddelliana, Revista Brasileira de Farmacognosia, 2002, 12, 26-28, https://doi.org/10.1590/S0102-695X2002000300013 . [all data]

Pinkston, Spiteller, et al., 1981
Pinkston, D.; Spiteller, G.; von Henning, H.; Matthaei, D., High-resolution gas chromatography-mass spectrometry of the methyl esters of organic acids from uremic hemofiltrates, J. Chromatogr., 1981, 223, 1, 1-19, https://doi.org/10.1016/S0378-4347(00)80063-8 . [all data]

Spiteller and Spiteller, 1979
Spiteller, M.; Spiteller, G., Trennung und charakterisierung saurer harnbest and- teile, J. Chromatogr., 1979, 164, 3, 253-317, https://doi.org/10.1016/S0378-4347(00)81232-3 . [all data]