PF2Cl+

Vibrational and/or electronic energy levels

Data compiled by: Marilyn E. Jacox

State:   F

 Energy
 (cm-1
 Med.   Transition   λmin
 (nm)
 λmax
 (nm)

References

Txx = 58900 ± 1600 gas Cradock and Rankin, 1972

State:   E

 Energy
 (cm-1
 Med.   Transition   λmin
 (nm)
 λmax
 (nm)

Txx = 52400 ± 1600 gas Cradock and Rankin, 1972

State:   D

 Energy
 (cm-1
 Med.   Transition   λmin
 (nm)
 λmax
 (nm)

Txx = 39500 ± 1600 gas Cradock and Rankin, 1972

State:   C

 Energy
 (cm-1
 Med.   Transition   λmin
 (nm)
 λmax
 (nm)

Txx = 33900 ± 1600 gas Cradock and Rankin, 1972

State:   B

 Energy
 (cm-1
 Med.   Transition   λmin
 (nm)
 λmax
 (nm)

Txx = 10500 ± 1600 gas Cradock and Rankin, 1972

Additional references: Jacox, 1994, page 220

Cradock and Rankin, 1972
Cradock, S.; Rankin, D.W.H., J. Chem. Soc., 1972, Faraday Trans. 2 68, 940. [all data]

Jacox, 1994
Jacox, M.E., Vibrational and electronic energy levels of polyatomic transient molecules, American Chemical Society, Washington, DC, 1994, 464. [all data]