Octane, 2,5-dimethyl-

Normal alkane RI, non-polar column, temperature ramp

Data compiled by: NIST Mass Spectrometry Data Center, William E. Wallace, director

Column type Capillary
Active phase Polydimethyl siloxane: CP-Sil 5 CB
Column length (m) 60.
Carrier gas Helium
Substrate
Column diameter (mm) 0.25
Phase thickness (μm) 1.0
Tstart (C) 45.
Tend (C) 210.
Heat rate (K/min) 3.6
Initial hold (min) 1.45
Final hold (min) 2.72
I 929.
ReferenceBramston-Cook, 2013
Comment MSDC-RI

References

Bramston-Cook, 2013
Bramston-Cook, R., Kovats indices for C2-C13 hydrocarbons and selected oxygenated/halocarbons with 100 % dimethylpolysiloxane columns, 2013, retrieved from http://lotusinstruments.com/monographs/List .... [all data]