CAS Reg. No. 158445-17-1

Reaction thermochemistry data

Data compiled by: John E. Bartmess

Individual Reactions

(CAS Reg. No. 158445-17-1 • 4294967295Aluminum) + Aluminum = CAS Reg. No. 158445-17-1

By formula: (CAS Reg. No. 158445-17-1 • 4294967295Al) + Al = CAS Reg. No. 158445-17-1

Quantity Value Units Method Reference Comment
Δr426.3 ± 7.5kJ/molN/ANakajima, Taguwa, et al., 1995gas phase; Vertical Detachment Energy: 2.75±0.04 eV

References

Nakajima, Taguwa, et al., 1995
Nakajima, A.; Taguwa, T.; Nakao, K.; Hoshino, K.; Iwata, S.; Kaya, K., Photoelectron Spectroscopy of AlnS1- Clusters (n=1-9), J. Chem. Phys., 1995, 102, 2, 660, https://doi.org/10.1063/1.469178 . [all data]