Pyrazine, 5-butyl-2,3-dimethyl-
- Formula: C10H16N2
- Molecular weight: 164.2474
- IUPAC Standard InChIKey: RYKQVGCVJZOAAN-UHFFFAOYSA-N
- CAS Registry Number: 15834-78-3
- Chemical structure:

Van Den Dool and Kratz RI, non-polar column, temperature ramp

Column type | Active phase | I | Reference | Comment |
---|---|---|---|---|
Capillary | DB-1 | 1198. | Izzo and Ho, 1991 | 50. m/0.32 mm/1.05 μm, He, 2. K/min, 260. C @ 40. min; Tstart: 40. C |

Normal alkane RI, non-polar column, temperature ramp

Column type | Active phase | I | Reference | Comment |
---|---|---|---|---|
Capillary | OV-101 | 1254. | Mihara and Masuda, 1987 | N2, 2. K/min; Column length: 50. m; Column diameter: 0.22 mm; Tstart: 80. C; Tend: 200. C |

Normal alkane RI, polar column, custom temperature program

Column type | Active phase | I | Reference | Comment |
---|---|---|---|---|
Capillary | Carbowax 20M | 1600. | Mihara and Masuda, 1987 | Program: not specified |

References

Izzo and Ho, 1991
Izzo, H.V.; Ho, C.-T.,
Isolation and identification of the volatile components of an extruded autolyzed yeast extract,
J. Agric. Food Chem., 1991, 39, 12, 2245-2248, https://doi.org/10.1021/jf00012a029
. [all data]
Mihara and Masuda, 1987
Mihara, S.; Masuda, H.,
Correlation between molecular structures and retention indices of pyrazines,
J. Chromatogr., 1987, 402, 309-317, https://doi.org/10.1016/0021-9673(87)80029-8
. [all data]