2,3-Quinoxalinedione, 1,4-dihydro-

Phase change data

Data compiled by: William E. Acree, Jr., James S. Chickos

Quantity Value Units Method Reference Comment
Δsub156.3 ± 5.5kJ/molCRibeiro da Silva, Matos, et al., 2000

References

Ribeiro da Silva, Matos, et al., 2000
Ribeiro da Silva, M.A.V.; Matos, M.A.R.; Rio, C.M.A.; Miranda, M.S.; Morais, V.M.F., Thermochemical and Theoretical Studies of 2-Hydroxyquinoxaline, 2,3-Dihydroxyquinoxaline, and 2-Hydroxy-3-methylquinoxaline, J. Phys. Chem. A, 2000, 104, 28, 6644-6648, https://doi.org/10.1021/jp000694y . [all data]

Gottlieb and Pfleiderer, 1978
Gottlieb, R.; Pfleiderer, W., Chem. Ber., 1978, 111, 1763. [all data]