OSrO

Vibrational and/or electronic energy levels

Data compiled by: Marilyn E. Jacox

State:   X

Vib.
sym.
 No.   Approximate
 type of mode
 cm-1   Med.   Method   References

b2 3 Asym. stretch 532.4 Ar IR Andrews, Yustein, et al., 1994
3 Asym. stretch 496.1 N2 IR Andrews, Chertihin, et al., 1996

Additional references: Jacox, 1998, page 174

References

Andrews, Yustein, et al., 1994
Andrews, L.; Yustein, J.T.; Thompson, C.A.; Hunt, R.D., Reactions of Pulsed-Laser Evaporated Ca, Sr, and Ba Atoms with O2. Infrared Spectra of the Metal Oxides, Oxide Dimers, Dioxides, and Peroxides in Solid Argon, J. Phys. Chem., 1994, 98, 26, 6514, https://doi.org/10.1021/j100077a016 . [all data]

Andrews, Chertihin, et al., 1996
Andrews, L.; Chertihin, G.V.; Thompson, C.A.; Dillon, J.; Byrne, S.; Bauschlicher, C.W., Jr., Infrared Spectra and Quantum Chemical Calculations of Group 2 MO, J. Phys. Chem., 1996, 100, 24, 10088, https://doi.org/10.1021/jp953763v . [all data]

Jacox, 1998
Jacox, M.E., Vibrational and electronic energy levels of polyatomic transient molecules: supplement A, J. Phys. Chem. Ref. Data, 1998, 27, 2, 115-393, https://doi.org/10.1063/1.556017 . [all data]