1,1,1-Trifluoro-4-hydroxy-4-(2-thienyl)-3-buten-2-one

Gas phase thermochemistry data

Data compiled by: Hussein Y. Afeefy, Joel F. Liebman, and Stephen E. Stein

Quantity Value Units Method Reference Comment
Δfgas-862.4 ± 4.2kJ/molCcrRibeiro da Silva, Santos, et al., 1997

Condensed phase thermochemistry data

Data compiled by: Hussein Y. Afeefy, Joel F. Liebman, and Stephen E. Stein

Quantity Value Units Method Reference Comment
Δfsolid-948.6 ± 4.1kJ/molCcrRibeiro da Silva, Santos, et al., 1997

References

Ribeiro da Silva, Santos, et al., 1997
Ribeiro da Silva, M.A.V.; Santos, L.M.N.B.F.; Pilcher, G., Standard enthalpies of formation of 2-thenoyltrifluoroacetone and monothio-2-thenoyltrifluoroacetone by rotating-bomb calorimetry, J. Chem. Thermodyn., 1997, 29, 757-764. [all data]