2-Furyl trimethyl silane

Gas phase ion energetics data

Data compiled as indicated in comments:
LBLHLM - Sharon G. Lias, John E. Bartmess, Joel F. Liebman, John L. Holmes, Rhoda D. Levin, and W. Gary Mallard

Ionization energy determinations

IE (eV) Method Reference Comment
8.2PEVeszpremi, Nyulaszi, et al., 1987LBLHLM
8.1PEZykov, Erchak, et al., 1983LBLHLM
8.44PEVeszpremi, Nyulaszi, et al., 1987Vertical value; LBLHLM
8.53PEZykov, Erchak, et al., 1983Vertical value; LBLHLM

References

Veszpremi, Nyulaszi, et al., 1987
Veszpremi, T.; Nyulaszi, L.; Nagy, J., Ultraviolet photoelectron spectroscopy and quantum-mechanical study of alkyl- and trimethylsilyl-furanes, J. Organomet. Chem., 1987, 331, 175. [all data]

Zykov, Erchak, et al., 1983
Zykov, B.G.; Erchak, N.P.; Khvostenko, V.I.; Lukevits, E.; Matorykina, V.F.; Asfandiarov, N.L., Photoelectron spectra of furylsilanes and their carbon analogs, J. Organomet. Chem., 1983, 253, 301. [all data]