2-Penten-1-ol, (E)-

Van Den Dool and Kratz RI, polar column, custom temperature program

Data compiled by: NIST Mass Spectrometry Data Center, William E. Wallace, director

Column type CapillaryCapillaryCapillaryCapillaryCapillary
Active phase Supelcowax-10Supelcowax-10DB-WaxDB-WaxDB-Wax
Column length (m) 30.30.30.30.30.
Carrier gas HeHeHeHeHe
Substrate
Column diameter (mm) 0.250.250.320.320.32
Phase thickness (μm) 0.250.250.50.50.5
Program 35C(8min) => 4C/min => 60C => 6C/min => 160C => 20C/min => 200C(1min)40C(1min) => 10C/min => 120C => 15C/min => 200C (1min)40C(5min) => 10C/min => 160C => 15C/min => 230C50C => 6C/min => 70C => 4C/min => 150C => 10C/min => 250C50C => 6C/min => 70C => 4C/min => 150C => 10C/min => 250C
I 1335.1338.1303.1321.1321.
ReferenceBianchi, Careri, et al., 2007Bianchi, Careri, et al., 2007Hallier, Prost, et al., 2005Pennarun, Prost, et al., 2003Pennarun, Prost, et al., 2002
Comment MSDC-RI MSDC-RI MSDC-RI MSDC-RI MSDC-RI
Column type CapillaryCapillaryCapillary
Active phase DB-WaxDB-WaxDB-Wax
Column length (m) 30.30.30.
Carrier gas HeHe
Substrate
Column diameter (mm) 0.320.320.32
Phase thickness (μm) 0.50.50.5
Program 50C => 5C/min => 180C => 10C/min => 250C50C => 5C/min => 180C => 10C/min => 250C50C => 3C/min => 180C => 5C/min => 250C (15min)
I 1300.1305.1325.
ReferenceSérot, Regost, et al., 2002Sérot, Regost, et al., 2001Prost, Serot, et al., 1998
Comment MSDC-RI MSDC-RI MSDC-RI

Normal alkane RI, non-polar column, custom temperature program

Data compiled by: NIST Mass Spectrometry Data Center, William E. Wallace, director

Column type CapillaryCapillary
Active phase HP-1DB-1
Column length (m) 50.60.
Carrier gas He
Substrate
Column diameter (mm) 0.320.32
Phase thickness (μm) 0.52
Program 40C => 2C/min => 130C => 4C/min => 250C (25min)not specified
I 759.744.
ReferenceSenger-Emonnot, Rochard, et al., 2006Binder, Flath, et al., 1989
Comment MSDC-RI MSDC-RI

Van Den Dool and Kratz RI, non-polar column, temperature ramp

Data compiled by: NIST Mass Spectrometry Data Center, William E. Wallace, director

Column type CapillaryCapillary
Active phase CP-Sil 8CB-MSCP Sil 8 CB
Column length (m) 0.60.
Carrier gas HeHe
Substrate
Column diameter (mm) 0.250.25
Phase thickness (μm) 0.250.25
Tstart (C) 40.40.
Tend (C) 280.280.
Heat rate (K/min) 4.4.
Initial hold (min) 2.2.
Final hold (min) 5.
I 769.769.
ReferenceElmore, Cooper, et al., 2005Elmore, Campo, et al., 2002
Comment MSDC-RI MSDC-RI

References

Bianchi, Careri, et al., 2007
Bianchi, F.; Careri, M.; Mangia, A.; Musci, M., Retention indices in the analysis of food aroma volatile compounds in temperature-programmed gas chromatography: Database creation and evaluation of precision and robustness, J. Sep. Sci., 2007, 39, 4, 563-572, https://doi.org/10.1002/jssc.200600393 . [all data]

Hallier, Prost, et al., 2005
Hallier, A.; Prost, C.; Serot, T., Influence in rearing conditions on the volatile compounds of cooked fillets of Silurus glanis (European catfish), J. Agric. Food Chem., 2005, 53, 18, 7204-7211, https://doi.org/10.1021/jf050559o . [all data]

Pennarun, Prost, et al., 2003
Pennarun, A.-L.; Prost, C.; Haure, J.; Demaimay, M., Comparison of two microalgal diets. 2. Influence on odorant composition and organoleptic qualities of raw oysters (Crassostrea gigas), J. Agric. Food Chem., 2003, 51, 7, 2011-2018, https://doi.org/10.1021/jf020549c . [all data]

Pennarun, Prost, et al., 2002
Pennarun, A.L.; Prost, C.; Demaimay, M., Identification and origin of the character-impact compounds of raw oyster Crassostrea gigas, J. Sci. Food Agric., 2002, 82, 14, 1652-1660, https://doi.org/10.1002/jsfa.1236 . [all data]

Sérot, Regost, et al., 2002
Sérot, T.; Regost, C.; Arzel, J., Identification of odour-active compounds in muscle of brown trout (Salmo trutta) as affected by dietary lipid sources, J. Sci. Food Agric., 2002, 82, 6, 636-643, https://doi.org/10.1002/jsfa.1096 . [all data]

Sérot, Regost, et al., 2001
Sérot, T.; Regost, C.; Prost, C.; Robin, J.; Arzel, J., Effect of dietary lipid sources on odour-active compounds in muscle of turbot (Psetta maxima), J. Sci. Food Agric., 2001, 81, 14, 1339-1346, https://doi.org/10.1002/jsfa.950 . [all data]

Prost, Serot, et al., 1998
Prost, C.; Serot, T.; Demaimay, M., Identification of the most potent odorants in wild and farmed cooked turbot (Scophtalamus maximus L.), J. Agric. Food Chem., 1998, 46, 8, 3214-3219, https://doi.org/10.1021/jf980128o . [all data]