3-Heptanol, 3,6-dimethyl-

Phase change data

Data compiled by: Thermodynamics Research Center, NIST Boulder Laboratories, Chris Muzny director

Quantity Value Units Method Reference Comment
Tboil446.15KN/AClarke and Beggs, 1912Uncertainty assigned by TRC = 2. K

In addition to the Thermodynamics Research Center (TRC) data available from this site, much more physical and chemical property data is available from the following TRC products:

Normal alkane RI, non-polar column, custom temperature program

View large format table.

Column type Active phase I Reference Comment
CapillaryMethyl Silicone987.Feng and Mu, 2007Program: not specified
CapillaryMethyl Silicone987.Estrada and Gutierrez, 1999Program: not specified

References

Clarke and Beggs, 1912
Clarke, L.; Beggs, S.A., 2,5-Dimethylheptane, J. Am. Chem. Soc., 1912, 34, 54. [all data]

Feng and Mu, 2007
Feng, H.; Mu, L.-L., Quantitative structure-retention relationships for alkane and its derivatives based on electrotopological state index and molecular shape index, Chem. Ind. Engineering (Chinese), 2007, 24, 2, 161-168. [all data]

Estrada and Gutierrez, 1999
Estrada, E.; Gutierrez, Y., Modeling chromatographic parameters by a novel graph theoretical sub-structural approach, J. Chromatogr. A, 1999, 858, 2, 187-199, https://doi.org/10.1016/S0021-9673(99)00808-0 . [all data]