C60H18 radical

Gas phase ion energetics data

Data compiled by: John E. Bartmess

Electron affinity determinations

EA (eV) Reference Comment
1.50 ± 0.10Vasil'ev, Absalimov, et al., 2001

References

Vasil'ev, Absalimov, et al., 2001
Vasil'ev, Y.V.; Absalimov, R.R.; Nasibullaev, S.K.; Lobach, A.S.; Drewello, T., Formation and characterization of long-lived negative molecular ions of C60H18, J. Phys. Chem. A, 2001, 105, 4, 661-665, https://doi.org/10.1021/jp002890a . [all data]