1-Ethynylnaphthalene

Gas phase ion energetics data

Data compiled as indicated in comments:
LLK - Sharon G. Lias, Rhoda D. Levin, and Sherif A. Kafafi

Ionization energy determinations

IE (eV) Method Reference Comment
8.03PEGleiter, Schafer, et al., 1981LLK

References

Gleiter, Schafer, et al., 1981
Gleiter, R.; Schafer, W.; Eckert-Maksic, M., Transannulare Wechselwirkungen zwischen Acetylenen - Photoelektronenspektroskopische Untersuchungen an 1,8-Diethinylnaphthalin und cyclischen Derivaten von 2,2'-Diethinylbiphenyl, Chem. Ber., 1981, 114, 2309. [all data]