Dioxirane

Gas phase thermochemistry data

Data compiled by: Glushko Thermocenter, Russian Academy of Sciences, Moscow

Constant pressure heat capacity of gas

Cp,gas (J/mol*K) Temperature (K) Reference Comment
33.2650.Dorofeeva O.V., 1992p=1 bar.
33.29100.
33.87150.
35.94200.
41.56273.15
43.9 ± 3.0298.15
44.05300.
53.53400.
61.82500.
68.53600.
73.93700.
78.35800.
82.03900.
85.131000.
87.761100.
90.011200.
91.941300.
93.611400.
95.051500.

References

Dorofeeva O.V., 1992
Dorofeeva O.V., Ideal gas thermodynamic properties of oxygen heterocyclic compounds. Part 1. Three-membered, four-membered and five-membered rings, Thermochim. Acta, 1992, 194, 9-46. [all data]