Bullvalone

Gas phase ion energetics data

Data compiled by: Henry M. Rosenstock, Keith Draxl, Bruce W. Steiner, and John T. Herron

Ionization energy determinations

IE (eV) Method Reference
8.72PEBodor, Dewar, et al., 1970

References

Bodor, Dewar, et al., 1970
Bodor, N.; Dewar, M.J.S.; Worley, S.D., Photoelectron spectra of molecules. III. Ionization potentials of some cyclic hydrocarbons and their derivatives, and heats of formation and ionization potentials calculated by the MINDO SCF MO method, J. Am. Chem. Soc., 1970, 92, 19. [all data]