Benzene, 1,4-dibutyl

Kovats' RI, polar column, isothermal

Data compiled by: NIST Mass Spectrometry Data Center, William E. Wallace, director

Column type Capillary
Active phase Carbowax 20M
Column length (m) 100.
Carrier gas N2
Substrate
Column diameter (mm) 0.23
Phase thickness (μm)
Temperature (C) 100.
I 1640.3
ReferenceEngewald and Wennrich, 1976
Comment MSDC-RI

References

Engewald and Wennrich, 1976
Engewald, W.; Wennrich, L., Molekülstruktur und Retentionsverhalten. VIII. Zum Retentionsverhalten höherer Alkylbenzole bei der Gas-Verteilungs-Chromatographie, Chromatographia, 1976, 9, 11, 540-547, https://doi.org/10.1007/BF02275960 . [all data]