Oxirene

Gas phase thermochemistry data

Data compiled by: Glushko Thermocenter, Russian Academy of Sciences, Moscow

Constant pressure heat capacity of gas

Cp,gas (J/mol*K) Temperature (K) Reference Comment
33.2650.Dorofeeva O.V., 1992p=1 bar.
34.07100.
37.67150.
43.13200.
51.56273.15
54.2 ± 3.0298.15
54.40300.
63.25400.
69.77500.
74.75600.
78.73700.
82.07800.
84.92900.
87.401000.
89.561100.
91.451200.
93.111300.
94.561400.
95.831500.

References

Dorofeeva O.V., 1992
Dorofeeva O.V., Ideal gas thermodynamic properties of oxygen heterocyclic compounds. Part 1. Three-membered, four-membered and five-membered rings, Thermochim. Acta, 1992, 194, 9-46. [all data]