13-Methylheptacosane

Normal alkane RI, non-polar column, temperature ramp

Data compiled by: NIST Mass Spectrometry Data Center, William E. Wallace, director

Column type CapillaryCapillaryCapillaryCapillaryCapillary
Active phase RTX-5 MSDB-1OV-1Ultra-1DB-5
Column length (m) 30.30.100.12.530.
Carrier gas HeliumHeliumHeliumHeHe
Substrate
Column diameter (mm) 0.250.250.320.20.32
Phase thickness (μm) 0.250.250.25
Tstart (C) 50.100.30.150.200.
Tend (C) 330.300.310.320.280.
Heat rate (K/min) 12.6.5.4.3.
Initial hold (min)
Final hold (min) 1.20.5.
I 2736.2735.2735.02733.2731.
ReferenceFox, Pianaro, et al., 2012Strohm, Herner, et al., 2008Krkosova, Kubinec, et al., 2007Nelson and Charlet, 2003Juárez, Blomquist, et al., 2001
Comment MSDC-RI MSDC-RI MSDC-RI MSDC-RI MSDC-RI
Column type CapillaryCapillaryCapillaryCapillaryCapillary
Active phase OV-1BP-1BP-1BP-1Dexsil 300
Column length (m) 40.12.25.25.15.
Carrier gas ArHeliumHeliumHelium
Substrate
Column diameter (mm)  0.220.250.25
Phase thickness (μm)  0.250.250.25
Tstart (C) 200.100.160.160.50.
Tend (C) 310.300.300.300.370.
Heat rate (K/min) 2.2.1.51.55.
Initial hold (min)
Final hold (min)
I 2734.2733.2734.2735.2731.
ReferenceSzafranek, Malinski, et al., 1994Lockey and Oraha, 1990Lockey and Dularay, 1986Lockey and Dularay, 1986Lockey, 1978
Comment MSDC-RI MSDC-RI MSDC-RI MSDC-RI MSDC-RI
Column type CapillaryCapillary
Active phase Dexsil 300Dexsil 300
Column length (m) 15.15.
Carrier gas
Substrate
Column diameter (mm)
Phase thickness (μm)
Tstart (C) 240.240.
Tend (C) 330.330.
Heat rate (K/min) 2.2.
Initial hold (min)
Final hold (min)
I 2728.2730.
ReferenceLockey, 1978, 2Lockey, 1978, 2
Comment MSDC-RI MSDC-RI

References

Fox, Pianaro, et al., 2012
Fox, E.G.P.; Pianaro, A.; Solis, D.R.; Delabie, J.H.C.; Vairo, B.C.; Machado, E. deA.; Bueno, O.C., Intraspecific and intracolonial variations in the profile of vanom alkaloids and cuticular hydrocarbons of the fire ant Solenopsis saevissima Smith (Hymenoptera: Formicidae), Psyshe, 2012, 1-10. [all data]

Strohm, Herner, et al., 2008
Strohm, E.; Herner, G.; Kaltenpoth, M.; Boland, W.; Schreier, P.; Geiselhardt, S.; Peschke, K.; Schmitt, T., The chemistry of the postpharyngeal gland of female European beewolves, J. Chem. Ecol., 2008, 34, 5, 575-583, https://doi.org/10.1007/s10886-008-9447-x . [all data]

Krkosova, Kubinec, et al., 2007
Krkosova, Z.; Kubinec, R.; Addova, G.; Jurdakova, H.; Blasko, J.; Ostrovsky, I.; Sojak, L., Gas chromatographic - mass spectrometric characterization of monomethylalkanes from fuel diesel, Petroleum Coal, 2007, 49, 3, 51-62. [all data]

Nelson and Charlet, 2003
Nelson, D.R.; Charlet, L.D., Cuticular hydrocarbons of the sunflower beetle,Zygogramma exclamationis, Comp. Biochem. Physiol. B: Comp. Biochem., 2003, 135, 2, 273-284, https://doi.org/10.1016/S1096-4959(03)00080-0 . [all data]

Juárez, Blomquist, et al., 2001
Juárez, P.; Blomquist, G.J.; Schofield, C.J., Hydrocarbons of Rhodnius prolixus, a Chagas disease vector, Comp. Biochem. Physiol. B: Comp. Biochem., 2001, 129, 4, 733-746, https://doi.org/10.1016/S1096-4959(01)00380-3 . [all data]

Szafranek, Malinski, et al., 1994
Szafranek, J.; Malinski, E.; Dubis, E.; Hebanowska, E.; Nawrot, J.; Oksman, P.; Pihlaja, K., Identification of branched alkanes in lipids of Leptinotarsa decemlineata say and Tribolium destructor by GC-MS: a comparison of main-beam and link-scanned spectra, J. Chem. Ecol., 1994, 20, 9, 2197-2212, https://doi.org/10.1007/BF02033197 . [all data]

Lockey and Oraha, 1990
Lockey, K.H.; Oraha, V.S., Cuticular lipids of adult Locusta Migratoria Migratoriodes (R and F), Schstocerca Gregaria (Forskal) (Acrididae) and other orthopteran species - II. Hydrocarbons, Comp. Biochem. Physiol., 1990, 95B, 4, 721-744. [all data]

Lockey and Dularay, 1986
Lockey, K.H.; Dularay, B., Cuticular methylalkanes of adult cockroaches, Blatta orientalis and Periplaneta Americana, Comp. Biochem. Physiol., 1986, 85B, 3, 567-572. [all data]

Lockey, 1978
Lockey, K.H., The adult cuticular hydrocarbons of Tenebrio Molitor L. and Tenebrio Obscurus F. (Coleoptera: Tenebrionidae), Insect Biochem., 1978, 8, 4, 237-250, https://doi.org/10.1016/0020-1790(78)90032-X . [all data]

Lockey, 1978, 2
Lockey, K.H., Hydrocarbons of adult Tribolum castaneum Hbst. and Tribolium confusum duv. (Coleoptera: Tenebrionidae), Comparative Biochem. Physiol., 1978, 61B, 401-407. [all data]