11-Methylpentacosane

Van Den Dool and Kratz RI, non-polar column, custom temperature program

View large format table.

Column type Active phase I Reference Comment
CapillaryHP-5MS2529.1Andriamaharavo, 201430. m/0.25 mm/0.25 μm, He; Program: 60C (1 min) => 5 C/min => 210C => 10 C/min => 280C (15 min)

Normal alkane RI, non-polar column, temperature ramp

View large format table.

Column type Active phase I Reference Comment
CapillaryOV-12537.0Krkosova, Kubinec, et al., 2007100. m/0.32 mm/0.25 μm, Helium, 5. K/min, 310. C @ 5. min; Tstart: 30. C
CapillaryBP-12534.Lockey and Dularay, 198625. m/0.25 mm/0.25 μm, Helium, 1.5 K/min; Tstart: 160. C; Tend: 300. C
CapillaryBP-12537.Lockey and Dularay, 198625. m/0.25 mm/0.25 μm, Helium, 1.5 K/min; Tstart: 160. C; Tend: 300. C
CapillaryDexsil 3002535.Lockey, 19785. K/min; Column length: 15. m; Tstart: 50. C; Tend: 370. C

Normal alkane RI, non-polar column, custom temperature program

View large format table.

Column type Active phase I Reference Comment
Capillary 2534.Steiger, Peschke, et al., 2007Program: not specified
Capillary 2565.Steiger, Peschke, et al., 2007Program: not specified
Capillary 2533.Lapointe, Hunter, et al., 2004Program: not specified

References

Andriamaharavo, 2014
Andriamaharavo, N.R., Retention Data. NIST Mass Spectrometry Data Center., NIST Mass Spectrometry Data Center, 2014. [all data]

Krkosova, Kubinec, et al., 2007
Krkosova, Z.; Kubinec, R.; Addova, G.; Jurdakova, H.; Blasko, J.; Ostrovsky, I.; Sojak, L., Gas chromatographic - mass spectrometric characterization of monomethylalkanes from fuel diesel, Petroleum Coal, 2007, 49, 3, 51-62. [all data]

Lockey and Dularay, 1986
Lockey, K.H.; Dularay, B., Cuticular methylalkanes of adult cockroaches, Blatta orientalis and Periplaneta Americana, Comp. Biochem. Physiol., 1986, 85B, 3, 567-572. [all data]

Lockey, 1978
Lockey, K.H., The adult cuticular hydrocarbons of Tenebrio Molitor L. and Tenebrio Obscurus F. (Coleoptera: Tenebrionidae), Insect Biochem., 1978, 8, 4, 237-250, https://doi.org/10.1016/0020-1790(78)90032-X . [all data]

Steiger, Peschke, et al., 2007
Steiger, S.; Peschke, K.; Francke, W.; Muller, J.K., The smell of parents: breeding status influences cuticular hydrocarbon pattern in the burying beetle Nicrophorus vespilloides, Proc. Roy. Soc. B, 2007, 274, 1622, 2211-2220, https://doi.org/10.1098/rspb.2007.0656 . [all data]

Lapointe, Hunter, et al., 2004
Lapointe, S.L.; Hunter, W.B.; Alessandro, R.T., Cuticular hydrocarbons on elytra of the Diaprepes root weevil Diaprepes abbreviatus (L.) (Coleoptera: Curculionidae), Agric. For. Entomol., 2004, 6, 4, 251-257, https://doi.org/10.1111/j.1461-9555.2004.00230.x . [all data]