Tributylphosphinemolybdenum pentacarbonyl

Gas phase ion energetics data

Data compiled by: Henry M. Rosenstock, Keith Draxl, Bruce W. Steiner, and John T. Herron

Ionization energy determinations

IE (eV) Method Reference
7.51 ± 0.05EIDistefano, Innorta, et al., 1968

References

Distefano, Innorta, et al., 1968
Distefano, G.; Innorta, G.; Pignataro, S.; Foffani, A., Correlation between the ionization potentials of transition metal complexes and of the corresponding ligands, J. Organometal. Chem., 1968, 14, 165. [all data]