2-Ethyl-4-methylthiazole

Normal alkane RI, polar column, temperature ramp

Data compiled by: NIST Mass Spectrometry Data Center, William E. Wallace, director

Column type Capillary
Active phase Carbowax 20M
Column length (m) 100.
Carrier gas
Substrate
Column diameter (mm) 0.25
Phase thickness (μm)
Tstart (C) 70.
Tend (C) 170.
Heat rate (K/min) 1.
Initial hold (min)
Final hold (min)
I 1352.
ReferenceShibamoto and Russell, 1977
Comment MSDC-RI

Van Den Dool and Kratz RI, non-polar column, temperature ramp

Data compiled by: NIST Mass Spectrometry Data Center, William E. Wallace, director

Column type CapillaryCapillary
Active phase DB-1DB-1
Column length (m) 20.20.
Carrier gas
Substrate
Column diameter (mm) 0.180.18
Phase thickness (μm) 0.180.18
Tstart (C) 60.60.
Tend (C) 220.220.
Heat rate (K/min) 8.8.
Initial hold (min) 3.3.
Final hold (min) 5.5.
I 948.948.
ReferenceRochat S., de Saint Laumer J.Y., et al., 2007Rochat S., de Saint Laumer J.Y., et al., 2007
Comment MSDC-RI MSDC-RI

References

Shibamoto and Russell, 1977
Shibamoto, T.; Russell, G.F., A study of the volatiles isolated from a D-glucose-hydrogen sulfide-ammonia model system, J. Agric. Food Chem., 1977, 25, 1, 109-112, https://doi.org/10.1021/jf60209a054 . [all data]