Thiazole, 2-ethyl-

Normal alkane RI, non-polar column, custom temperature program

Data compiled by: NIST Mass Spectrometry Data Center, William E. Wallace, director

Column type CapillaryCapillaryCapillary
Active phase DB-1DB-1SE-30
Column length (m) 20.20.
Carrier gas
Substrate
Column diameter (mm) 0.180.18
Phase thickness (μm) 0.180.18
Program not specifiednot specifiednot specified
I 867.869.879.
ReferenceChantreau, Rochat, et al., 2006Chantreau, Rochat, et al., 2006Vinogradov, 2004
Comment MSDC-RI MSDC-RI MSDC-RI

Normal alkane RI, polar column, custom temperature program

Data compiled by: NIST Mass Spectrometry Data Center, William E. Wallace, director

Column type Capillary
Active phase Carbowax 20M
Column length (m)
Carrier gas
Substrate
Column diameter (mm)
Phase thickness (μm)
Program not specified
I 1300.
ReferenceVinogradov, 2004
Comment MSDC-RI

References

Chantreau, Rochat, et al., 2006
Chantreau, A.; Rochat, S.; de Saint Laumer, J.-Y., Re-investigation of sulfur impact odorants in roast beef using comprehensive two-dimensional GC-TOF-MS and the GC-SNIF, Developments Food. Sci., 2006, 43, 601-604. [all data]

Vinogradov, 2004
Vinogradov, B.A., Production, composition, properties and application of essential oils, 2004, retrieved from http://viness.narod.ru. [all data]