Tributyl gallium

Phase change data

Data compiled by: William E. Acree, Jr., James S. Chickos

Enthalpy of vaporization

ΔvapH (kcal/mol) Temperature (K) Method Reference Comment
12.3 ± 0.31354.N/ABaev, 2001Based on data from 330. - 378. K.
13.4441.AStephenson and Malanowski, 1987Based on data from 426. - 507. K.

References

Baev, 2001
Baev, A.K., Izv. Vyssh. Uchebn. Zaved., Khim. Khim. Tekhnol., 2001, 44, 1, 3. [all data]

Stephenson and Malanowski, 1987
Stephenson, Richard M.; Malanowski, Stanislaw, Handbook of the Thermodynamics of Organic Compounds, 1987, https://doi.org/10.1007/978-94-009-3173-2 . [all data]