μ3-Methylidyne-tricobalt nonacarbonyl

Gas phase ion energetics data

Data compiled as indicated in comments:
LBLHLM - Sharon G. Lias, John E. Bartmess, Joel F. Liebman, John L. Holmes, Rhoda D. Levin, and W. Gary Mallard
LLK - Sharon G. Lias, Rhoda D. Levin, and Sherif A. Kafafi

Ionization energy determinations

IE (eV) Method Reference Comment
7.9PEGranozzi, Tondello, et al., 1982LBLHLM
7.5PECosta, Lloyd, et al., 1982LBLHLM
7.8PEChesky and Hall, 1981LLK
8.75PEGranozzi, Tondello, et al., 1982Vertical value; LBLHLM
8.12 ± 0.09PECosta, Lloyd, et al., 1982Vertical value; LBLHLM
8.8PEChesky and Hall, 1981Vertical value; LLK

References

Granozzi, Tondello, et al., 1982
Granozzi, G.; Tondello, E.; Ajo, D.; Casarin, M.; Aime, S.; Osella, D., Gas phase helium I photoelectron spectra of methinyltricobalt enneacarbonyl clusters, Inorg. Chem., 1982, 21, 1081. [all data]

Costa, Lloyd, et al., 1982
Costa, N.C.V.; Lloyd, D.R.; Brint, P.; Pelin, W.K.; Spalding, T.R., The photoelectron spectra of enneacarbonyl-η3-methylidyne- tricobalt and some derivatives, J. Chem. Soc. Dalton Trans., 1982, 201. [all data]

Chesky and Hall, 1981
Chesky, P.T.; Hall, M.B., Electronic structure of metal clusters. 1. Photoelectron spectra and molecular orbital calculations on (alkylidyne)tricobalt nonacarbonyl clusters, Inorg. Chem., 1981, 20, 4419. [all data]