9-Bromoanthracene

Phase change data

Data compiled by: William E. Acree, Jr., James S. Chickos

Enthalpy of sublimation

ΔsubH (kJ/mol) Temperature (K) Method Reference
100.5 ± 1.8315. - 368.MEGoldfarb and Suuberg, 2008

Gas phase ion energetics data

Data compiled as indicated in comments:
LBLHLM - Sharon G. Lias, John E. Bartmess, Joel F. Liebman, John L. Holmes, Rhoda D. Levin, and W. Gary Mallard
LLK - Sharon G. Lias, Rhoda D. Levin, and Sherif A. Kafafi
B - John E. Bartmess

Electron affinity determinations

EA (eV) Method Reference Comment
0.61 ± 0.10CIDCChen and Cooks, 1995B

Ionization energy determinations

IE (eV) Method Reference Comment
7.58PEKlasinc, Kovac, et al., 1983LBLHLM
7.48 ± 0.03PEKlasinc, Kovac, et al., 1978Vertical value; LLK

References

Goldfarb and Suuberg, 2008
Goldfarb, Jillian L.; Suuberg, Eric M., The effect of halogen hetero-atoms on the vapor pressures and thermodynamics of polycyclic aromatic compounds measured via the Knudsen effusion technique, The Journal of Chemical Thermodynamics, 2008, 40, 3, 460-466, https://doi.org/10.1016/j.jct.2007.09.006 . [all data]

Chen and Cooks, 1995
Chen, G.D.; Cooks, R.G., Electron affinities of polycyclic aromatic hydrocarbons determined by the kinetic method, J. Mass Spectrom., 1995, 30, 8, 1167, https://doi.org/10.1002/jms.1190300814 . [all data]

Klasinc, Kovac, et al., 1983
Klasinc, L.; Kovac, B.; Gusten, H., Photoelectron spectra of acenes. Electronic structure and substituent effects, Pure Appl. Chem., 1983, 55, 289. [all data]

Klasinc, Kovac, et al., 1978
Klasinc, L.; Kovac, B.; Schoof, S.; Gusten, H., Photoelectron spectroscopy of 9-substituted anthracenes, Croat. Chem. Acta., 1978, 51, 307. [all data]