Acetamide, N-acetyl-N-phenyl-

Phase change data

Data compiled as indicated in comments:
AC - William E. Acree, Jr., James S. Chickos
ALS - Hussein Y. Afeefy, Joel F. Liebman, and Stephen E. Stein

Quantity Value Units Method Reference Comment
Δsub90.0 ± 0.8kJ/molCWadsö, Borgen, et al., 1965See also Cox and Pilcher, 1970.; AC
Δsub90.0 ± 0.8kJ/molCWadso, 1965ALS

Reaction thermochemistry data

Data compiled by: Hussein Y. Afeefy, Joel F. Liebman, and Stephen E. Stein

Individual Reactions

Acetamide, N-phenyl- + Acetic acid = C10H11NO2 + Water

By formula: C8H9NO + C2H4O2 = C10H11NO2 + H2O

Quantity Value Units Method Reference Comment
Δr45.5 ± 0.3kJ/molCmWadso, 1965solid phase; Heat of hydrolysis

References

Wadsö, Borgen, et al., 1965
Wadsö, Ingemar; Borgen, Gerd L.; Sørensen, Georg Ole; Olsen, Gert; Jansen, Gert, Thermochemical Properties of Diacetamide, N-Butyldiacetamide and N-Phenyldiacetamide., Acta Chem. Scand., 1965, 19, 1079-1087, https://doi.org/10.3891/acta.chem.scand.19-1079 . [all data]

Cox and Pilcher, 1970
Cox, J.D.; Pilcher, G., Thermochemistry of Organic and Organometallic Compounds, Academic Press Inc., London, 1970, 643. [all data]

Wadso, 1965
Wadso, I., Thermochemical properties of diacetimide, N-butyldiacetimide and N-phenyldiacetimide, Acta Chem. Scand., 1965, 19, 1079-1087. [all data]