Methanone, (2-amino-5-bromophenyl)-2-pyridinyl-

Kovats' RI, non-polar column, isothermal

Data compiled by: NIST Mass Spectrometry Data Center, William E. Wallace, director

Column type CapillaryPackedPacked
Active phase SPB-1SE-30SE-30
Column length (m) 25.
Carrier gas HeN2N2
Substrate
Column diameter (mm) 0.20
Phase thickness (μm)
Temperature (C) 250.220.250.
I 2240.2277.2259.
ReferenceLora-Tamayo, Rams, et al., 1986Schütz, 1982Schütz, 1982
Comment MSDC-RI MSDC-RI MSDC-RI

References

Lora-Tamayo, Rams, et al., 1986
Lora-Tamayo, C.; Rams, M.A.; Chacon, J.M.R., Gas Chromatographic Data for 187 Nitrogen- or Phosphorus-Containing Drugs and Metabolites of Toxicological Interest Analysed on Methyl Silicone Capillary Columns, J. Chromatogr., 1986, 374, 73-85, https://doi.org/10.1016/S0378-4347(00)83254-5 . [all data]

Schütz, 1982
Schütz, H., Benzodiazepines, Springer-Verlag, New York, 1982, 438. [all data]