Al2(CH3)6

Reaction thermochemistry data

Data compiled by: José A. Martinho Simões

Individual Reactions

C6H18Al2 (l) = 2Trimethylaluminum (l)

By formula: C6H18Al2 (l) = 2C3H9Al (l)

Quantity Value Units Method Reference Comment
Δr19.4 ± 0.31kcal/molEqSSmith, 1972

References

Smith, 1972
Smith, M.B., J. Organometal. Chem., 1972, 46, 31. [all data]